machine à mailler
terme associe: T69-3441
created: 2012-05-16T00:00:00+02:00
modified: 2015-10-08T13:55:10+02:00
status: 1
type: Concept
alternative label: machine à tricoter
broader: T69-5429
definition: Machine à entrelacer des fils (coton, laine, synthétique, etc.) en formant des boucles et des nœuds.
in scheme: T69
related: T69-3441