crémone
created: 2012-05-16T00:00:00+02:00
modified: 2015-01-23T17:20:51+01:00
status: 1
type: Concept
broad match: http://data.bnf.fr/ark:/12148/cb12122640d
broader: T69-542
definition: Organe fixé sur un vantail, permettant de le fermer par deux points opposés en haut et en bas et qui comporte deux tringles, se mouvant en sens contraire, et maniées par un bouton tournant une béquille ou une boucle. Le mouvement de rotation provoque un mouvement de translation rectiligne des tringles soit vers le haut, soit vers le bas, pour que celles-ci pénètrent dans les gâches placées à chaque extrémité.
in scheme: T69
preferred label: cremorne bolts @en-us