entrée de serrure
created: 2012-05-16T00:00:00+02:00
modified: 2015-01-23T17:26:27+01:00
status: 1
type: Concept
alternative label: écusson
broad match: cb11942807s
broader: T69-542
definition: Partie fixée sur la face extérieure de l'ouvrant, comportant un trou ou accueillage, qui sert à l'entrée de la clef dans une serrure, et destinée à protéger le bois. Une entrée peut être en plaque pleine ou ajourée ou en filet.
in scheme: T69
preferred label: keyhole surrounds @en-us