espagnolette
created: 2012-05-16T00:00:00+02:00
modified: 2015-01-23T17:31:35+01:00
status: 1
type: Concept
broad match: http://data.bnf.fr/ark:/12148/cb12122640d
broader: T69-542
definition: Organe de sécurité permettant la fermeture simultanée de deux vantaux. L'espagnolette comporte, fixée sur un des vantaux, une tringle unique maintenue par des guides ou lacets, tournant sur eux-mêmes, ce qui permet à ses extrémités, en forme de crochets, de pénétrer dans une gâche fixée sur le bâti.
in scheme: T69
preferred label: espagnolette bolts @en-us