machine à séparer un mélange
created: 2012-05-16T00:00:00+02:00
modified: 2014-01-10T00:00:00+01:00
status: 1
type: Concept
broader: T69-5545
definition: Machine à séparer les différents constituants d'un produit solide, liquide ou gazeux.
in scheme: T69
narrower: T69-5579
narrower: T69-5581