machine à découper
created: 2012-05-16T00:00:00+02:00
modified: 2015-10-14T10:40:39+02:00
status: 1
type: Concept
broader: T69-5583
definition: Machine à façonner par taille un produit solide, en suivant un contour prédéfini, pour en obtenir des éléments de dimensions ou de forme données.
in scheme: T69
narrower: T69-5587
narrower: T69-5589
narrower: T69-5591
narrower: T69-5593
narrower: T69-5595
narrower: T69-5597