machine à découper par cisaille
created: 2012-05-16T00:00:00+02:00
modified: 2015-08-12T16:09:55+02:00
status: 1
type: Concept
alternative label: cisaille
alternative label: cisaille circulaire
alternative label: cisaille double
alternative label: cisaille à guillotine
broader: T69-5585
definition: Machine à découper un produit par cisaillement avec lame et contre-lame.
in scheme: T69
narrow match: Cisaille
narrow match: http://vocab.getty.edu/aat/300024672
scope note: Ne pas confondre avec machine à découper par tranchoir (massicot).