machine à découper par jet
created: 2012-05-16T00:00:00+02:00
modified: 2015-10-14T10:45:49+02:00
status: 1
type: Concept
alternative label: table d'oxycoupage
broad match: http://vocab.getty.edu/aat/300162791
broader: T69-5585
definition: Machine à découper un produit par fusion à l'aide d'un jet thermique, de plasma, d'oxygène, etc.
in scheme: T69