machine à découper par tranchoir
created: 2012-05-16T00:00:00+02:00
modified: 2015-08-13T10:56:37+02:00
status: 1
type: Concept
alternative label: dérouleuse
alternative label: massicot
alternative label: massicot refendeur
alternative label: massicot trilatéral
alternative label: trancheuse
broader: T69-5585
definition: Machine à découper un produit à l'aide d'une lame effilée.
in scheme: T69
narrow match: http://data.bnf.fr/ark:/12148/cb161801859
narrow match: Massicot
narrow match: http://vocab.getty.edu/aat/300022407
scope note: Ne pas confondre avec machine à découper par cisaille.