machine à former
created: 2012-05-16T00:00:00+02:00
modified: 2015-10-14T10:55:08+02:00
status: 1
type: Concept
alternative label: machine à magnétoformer
alternative label: machine à thermoformer
broader: T69-5583
definition: Machine à façonner par déformation permanente un produit plat, pour obtenir un produit volumique creux.
in scheme: T69
narrower: T69-5601
narrower: T69-5603
narrower: T69-5607
narrower: T69-5609
narrower: T69-5613