loquet
created: 2012-05-16T00:00:00+02:00
modified: 2015-01-29T12:50:35+01:00
status: 1
type: Concept
broad match: http://data.bnf.fr/ark:/12148/cb12122640d
broader: T69-542
definition: Organe de fermeture, placé sur une partie mobile, constitué par une branche mobile et pivotante, la clenche (pêne, battant), dont la course est limitée par la garde de maintien et qui bute sur un crochet, le mentonnet, placé sur le bâti.
in scheme: T69
narrower: T69-563
preferred label: latches @en-us