machine à emboutir
created: 2012-05-16T00:00:00+02:00
modified: 2015-08-13T11:23:56+02:00
status: 1
type: Concept
alternative label: presse hydraulique
alternative label: presse à emboutir
broader: T69-5599
definition: Machine à former une surface plane à l'aide d'un poinçon et d'une matrice.
in scheme: T69
narrow match: Presse hydraulique