machine à former par pliage
terme associe: T69-5889
created: 2012-05-16T00:00:00+02:00
modified: 2015-08-13T11:54:17+02:00
status: 1
type: Concept
alternative label: plieuse
broader: T69-5599
definition: Machine à former une surface plane par pliure, pour obtenir un produit à arêtes vives.
in scheme: T69
narrow match: Plieuse
related: T69-5889
scope note: Ne pas confondre avec machine à plier.