poignée
created: 2012-05-16T00:00:00+02:00
modified: 2015-01-29T17:27:03+01:00
status: 1
type: Concept
alternative label: bouton de tirage
alternative label: pendeloque
broader: T69-532
definition: Organe de préhension et de tirage, parfois en forme de bouton ou de pendeloque, qui permet l’ouverture d’un vantail ou peut servir à la manœuvre d’un système de fermeture. Il peut être fixe, articulé ou tournant.
in scheme: T69
narrow match: http://data.bnf.fr/ark:/12148/cb125577259
preferred label: handles @en-us