machine à repousser
created: 2012-05-16T00:00:00+02:00
modified: 2014-01-10T00:00:00+01:00
status: 1
type: Concept
broader: T69-5599
definition: Machine à former une surface plane par repoussage, à l'aide d'un mandrin mobile et d'une molette.
in scheme: T69