machine à modeler
created: 2012-05-16T00:00:00+02:00
modified: 2015-10-14T11:53:40+02:00
status: 1
type: Concept
broader: T69-5583
definition: Machine à façonner une masse solide ou pâteuse par déformation plastique sous contrainte, pour obtenir un produit de forme prédéfinie.
in scheme: T69
narrower: T69-5619
narrower: T69-5621
narrower: T69-5625
narrower: T69-5639
narrower: T69-5641