machine à cintrer
created: 2012-05-16T00:00:00+02:00
modified: 2015-08-13T15:59:13+02:00
status: 1
type: Concept
alternative label: cintreuse
alternative label: cintreuse hydraulique
broader: T69-5617
definition: Machine à modeler par cintrage un produit linéaire plein ou creux (barre, rail, tube, tuyau, etc.), en maintenant sa section.
in scheme: T69
narrow match: Cintreuse
scope note: Ne pas confondre avec machine à former par cintrage.