machine à allonger
created: 2012-05-16T00:00:00+02:00
modified: 2014-01-10T00:00:00+01:00
status: 1
type: Concept
broader: T69-5617
definition: Machine à modeler un matériau ou un produit pour en augmenter la longueur.
in scheme: T69
narrower: T69-5629
narrower: T69-5631
narrower: T69-5633
narrower: T69-5637