machine à convoyer en continu
created: 2012-05-16T00:00:00+02:00
modified: 2015-10-14T14:48:33+02:00
status: 1
type: Concept
alternative label: transporteur à vis
alternative label: vis d'Archimède
alternative label: vis sans fin
broad match: http://vocab.getty.edu/aat/300024559
broader: T69-5691
definition: Machine à convoyer avec un déchargement continu.
in scheme: T69
narrow match: http://data.bnf.fr/ark:/12148/cb122113122
narrow match: Vis d'Archimède