machine à lever
created: 2012-05-16T00:00:00+02:00
modified: 2015-10-14T15:31:11+02:00
status: 1
type: Concept
broad match: http://vocab.getty.edu/aat/300162805
broader: T69-5689
definition: Machine à manutentionner des matériaux ou des produits par levage et portage.
in scheme: T69
narrower: T69-5713
narrower: T69-5715
narrower: T69-5717