machine à lever à bâti fixe
created: 2012-05-16T00:00:00+02:00
modified: 2015-10-14T15:40:50+02:00
status: 1
type: Concept
alternative label: grue pivotante fixe
alternative label: grue sur pylônes
alternative label: grue tournante fixe
alternative label: grue à tour
alternative label: potence
alternative label: sapine
broad match: cb11934277k
broader: T69-5711
definition: Machine à lever montée sur un support fixe.
in scheme: T69
narrow match: Grue à tour
narrow match: http://vocab.getty.edu/aat/300022343