machine à lever à bâti mobile guidé
created: 2012-05-16T00:00:00+02:00
modified: 2015-10-14T15:42:39+02:00
status: 1
type: Concept
alternative label: grue-portique
alternative label: pont roulant
alternative label: portique roulant
broader: T69-5711
definition: Machine à lever montée sur un support mobile dont le déplacement est guidé par des rails positionnés au sol (à l'extérieur des bâtiments) ou suspendus (à l'intérieur).
in scheme: T69
narrow match: cb12041845p
narrow match: Portique
narrow match: http://vocab.getty.edu/aat/300022341