machine à manipuler
created: 2012-05-16T00:00:00+02:00
modified: 2015-10-14T15:48:36+02:00
status: 1
type: Concept
alternative label: machine à basculer
alternative label: machine à prélever
broad match: http://vocab.getty.edu/aat/300162805
broader: T69-5689
definition: Machine à manutentionner un matériau ou un produit par préhension, basculement, etc., pour le mettre dans la position voulue.
in scheme: T69
narrower: T69-5725