machine à positionner
created: 2012-05-16T00:00:00+02:00
modified: 2015-10-14T15:51:30+02:00
status: 1
type: Concept
alternative label: manipulateur de forge
broad match: cb11946912m
broader: T69-5719
definition: Machine à saisir des matériaux ou des produits, afin de les amener en position d'utilisation.
in scheme: T69