verrou
created: 2012-05-16T00:00:00+02:00
modified: 2015-01-29T12:52:45+01:00
status: 1
type: Concept
alternative label: targette
broader: T69-542
definition: Organe de fermeture constitué par une branche de métal, le pêne, qui coulisse entre les conduits ou dans un guide unique. Le pêne, placé sur la partie mobile pénètre dans une gâche fixée sur le bâti ou sur un autre vantail. Le verrou peut être simple, ou à queue.
in scheme: T69
preferred label: bolts @en-us