machine à revêtir par dépôt
created: 2012-05-16T00:00:00+02:00
modified: 2015-09-25T10:58:20+02:00
status: 1
type: Concept
broader: T69-5785
definition: Machine à revêtir un produit par un dépôt fixé à l'aide d'un procédé électrostatique, électrolytique ou mécanique.
in scheme: T69