machine à araser
created: 2012-05-16T00:00:00+02:00
modified: 2015-10-14T16:55:26+02:00
status: 1
type: Concept
alternative label: polissoir automatique à plat
alternative label: polissoir à genouillière
broad match: http://vocab.getty.edu/aat/300163309
broader: T69-5797
definition: Machine à surfacer un produit plan pour mettre à niveau ses inégalités.
in scheme: T69