machine à lisser
created: 2012-05-16T00:00:00+02:00
modified: 2015-10-14T17:04:11+02:00
status: 1
type: Concept
alternative label: calandre
broader: T69-5797
definition: Machine à surfacer un produit (papier, étoffe, cuir, etc.) en lui donnant un aspect uni, lisse et brillant.
in scheme: T69
narrow match: Calandre
narrow match: http://vocab.getty.edu/aat/300023389
narrower: T69-5811