machine à polir
created: 2012-05-16T00:00:00+02:00
modified: 2015-09-03T16:33:22+02:00
status: 1
type: Concept
alternative label: ponceuse à plateau
alternative label: tonneau de polissage
alternative label: tonneau à polir
alternative label: tonneau à poncer
alternative label: tour à polir
alternative label: émeriseuse
broad match: http://data.bnf.fr/ark:/12148/cb125365509
broad match: Polissage
broader: T69-5809
definition: Machine à lisser un produit ou un matériau (marbre, verre optique, nacre, matière plastique, etc.) en le frottant à l'aide d'un abrasif.
in scheme: T69