autel itinéraire
terme associe: T69-1133
created: 2012-05-16T00:00:00+02:00
modified: 2014-12-01T12:03:16+01:00
status: 1
type: Concept
alternative label: autel de voyage
broad match: cb11943953g
broad match: Autel (christianisme)
broader: T69-578
definition: Meuble en forme de coffre ou de valise utilisé par les prêtres lors de leurs déplacements. Une fois ouvert, il se transforme en autel, avec une pierre d'autel consacrée et peut contenir tout ce qui est nécessaire à la célébration de la messe.
in scheme: T69
preferred label: portable altars (chests) @en-us
preferred label: altare da viaggio @it
preferred label: altar portátil @pt
related: T69-1133
scope note: Ne pas confondre avec l'autel portatif, l'oratoire domestique.