machine à démêler
created: 2012-05-16T00:00:00+02:00
modified: 2015-10-15T14:48:46+02:00
status: 1
type: Concept
alternative label: carde
alternative label: carde briseuse
alternative label: carde fileuse
alternative label: carde nappeuse
alternative label: cardeuse
broader: T69-5877
definition: Machine à arranger des fibres textiles enchevêtrées en les séparant les unes des autres et en les disposant parallèlement de manière à former un ruban prêt à être filé.
in scheme: T69
narrow match: Carde
narrow match: http://vocab.getty.edu/aat/300400775