machine à plier
terme associe: T69-5609
created: 2012-05-16T00:00:00+02:00
modified: 2015-09-24T17:28:19+02:00
status: 1
type: Concept
alternative label: machine à remplier
alternative label: plieuse de rotative
alternative label: plieuse à couteau
alternative label: plieuse à poches
broader: T69-5873
definition: Machine à arranger un produit (cuir, papier, tissu, etc.) en en rabattant une partie sur elle-même.
in scheme: T69
narrow match: Plieuse
related: T69-5609
scope note: Ne pas confondre avec machine à former par pliage.