ciborium
terme associe: T69-2173
created: 2012-05-16T00:00:00+02:00
modified: 2014-12-01T12:07:37+01:00
status: 1
type: Concept
alternative label: baldaquin d'autel
alternative label: ciboire d'autel
broader: T69-578
definition: Structure architectonique en forme de dais reposant sur des supports verticaux, en général au nombre de quatre et élevée au-dessus d'un autel pour le protéger et le mettre en valeur. Un ciborium postérieur à l'époque médiévale est généralement appelé baldaquin d'autel.
in scheme: T69
preferred label: ciboria (structures) @en-us
preferred label: ciborio @it
preferred label: cibório (elemento arquitectónico) @pt
related: T69-2173