machine à homogénéiser
created: 2012-05-16T00:00:00+02:00
modified: 2015-10-15T15:30:34+02:00
status: 1
type: Concept
alternative label: homogénéisateur
alternative label: malaxeur vertical
alternative label: malaxeur à vide
alternative label: mélangeur
alternative label: mélangeuse
broader: T69-5873
definition: Machine à organiser différents produits ou substances associées en vrac, en les mélangeant intimement afin d'en obtenir une composition homogène.
in scheme: T69
narrow match: cb12509728s
narrow match: http://vocab.getty.edu/aat/300023063