machine à calibrer des solides
terme associe: T69-5581
created: 2012-05-16T00:00:00+02:00
modified: 2015-10-15T15:07:44+02:00
status: 1
type: Concept
alternative label: calibreur
alternative label: calibreuse
alternative label: crible
alternative label: trieur
broader: T69-5873
definition: Machine à sélectionner un matériau en vrac (grain, pierre, charbon, etc.) selon des critères dimensionnels.
in scheme: T69
narrow match: http://data.bnf.fr/ark:/12148/cb145018330
narrow match: Crible
narrow match: http://vocab.getty.edu/aat/300023114
related: T69-5581