moule industriel
terme associe: T69-9632
created: 2012-05-16T00:00:00+02:00
modified: 2015-10-16T13:08:46+02:00
status: 1
type: Concept
broader: T69-6023
definition: Pièce creuse ou présentant une empreinte creuse, destinée à être remplie d'une substance pulvérulente, pâteuse ou liquide, qui, en se solidifiant, prend la forme exacte de ce creux ou de cette empreinte.
in scheme: T69
related: T69-9632