machine énergétique
created: 2012-05-16T00:00:00+02:00
modified: 2015-10-07T15:24:00+02:00
status: 1
type: Concept
definition: Machine constituée d'un ensemble d'organes dont les fonctions peuvent être de modifier, d'adapter, de changer, de transformer ou de produire de l’énergie.
in scheme: T69
narrower: T69-6030
narrower: T69-6038
narrower: T69-6058
narrower: T69-6104
narrower: T69-6196
narrower: T69-8097