convertisseur électrique
created: 2012-05-16T00:00:00+02:00
modified: 2015-08-03T16:07:23+02:00
status: 1
type: Concept
broader: T69-6038
definition: Convertisseur d'énergie électrique adaptant le courant, la tension ou la fréquence.
in scheme: T69
narrower: T69-6044
narrower: T69-6046
narrower: T69-6048
narrower: T69-6050