convertisseur de fréquence
created: 2012-05-16T00:00:00+02:00
modified: 2015-08-03T16:16:06+02:00
status: 1
type: Concept
broader: T69-6042
definition: Convertisseur électrique modifiant la fréquence d'un courant électrique.
in scheme: T69