onduleur
created: 2012-05-16T00:00:00+02:00
modified: 2015-10-07T14:19:27+02:00
status: 1
type: Concept
broader: T69-6042
definition: Convertisseur électrique transformant un courant unidirectionnel en un système de courants alternatifs (fonction inverse d'un redresseur=.
in scheme: T69
scope note: Ne pas confondre avec l’équipement qui permet d’obtenir une alimentation électrique stable et dépourvue de coupure, notamment pour les ordinateurs.