redresseur
created: 2012-05-16T00:00:00+02:00
modified: 2015-08-03T16:31:49+02:00
status: 1
type: Concept
broader: T69-6042
definition: Convertisseur électrique transformant un système de courants alternatifs en un courant unidirectionnel (fonction inverse d'un onduleur).
in scheme: T69