transformateur
created: 2012-05-16T00:00:00+02:00
modified: 2015-08-04T11:44:28+02:00
status: 1
type: Concept
alternative label: rhéostat
broader: T69-6042
definition: Convertisseur électrique servant à élever ou à abaisser la tension ou l’intensité d’un courant.
in scheme: T69