convertisseur de mouvement
created: 2012-05-16T00:00:00+02:00
modified: 2015-10-07T15:20:47+02:00
status: 1
type: Concept
alternative label: système bielle manivelle
broader: T69-6052
definition: Convertisseur mécanique permettant la transformation du mouvement circulaire en mouvement linéaire ou inversement.
in scheme: T69
narrow match: Système bielle-manivelle