générateur
created: 2012-05-16T00:00:00+02:00
modified: 2015-10-07T15:28:11+02:00
status: 1
type: Concept
broader: T69-6028
definition: Machine énergétique produisant de l’énergie.
in scheme: T69
narrower: T69-6060
narrower: T69-6066
narrower: T69-6068
narrower: T69-6074
narrower: T69-6078
narrower: T69-6080
narrower: T69-6084