générateur de particules
created: 2012-05-16T00:00:00+02:00
modified: 2015-08-05T11:14:13+02:00
status: 1
type: Concept
alternative label: accélérateur de particules
alternative label: cyclotron
alternative label: synchrotron
broader: T69-6058
definition: Générateur utilisant des champs magnétiques ou électriques pour amener des particules élémentaires à des vitesses très élevées.
in scheme: T69
narrow match: cb11966497v
narrow match: Accélérateur de particules
narrow match: http://vocab.getty.edu/aat/300120666