gradin d'autel
created: 2012-05-16T00:00:00+02:00
modified: 2014-12-01T12:38:57+01:00
status: 1
type: Concept
alternative label: gradin-reliquaire
broader: T69-578
definition: Caisson ou tablette, placé sur l'autel et en retrait, sur lequel on pose la croix d'autel, les chandeliers d'autel et autres objets et qui peut également contenir des reliques. Un autel peut avoir plusieurs gradins.
in scheme: T69
preferred label: gradines (altar shelves) @en-us
preferred label: gradino d'altare @it
preferred label: banqueta de altar @pt