générateur électrique
created: 2012-05-16T00:00:00+02:00
modified: 2015-10-07T15:57:21+02:00
status: 1
type: Concept
broader: T69-6058
definition: Générateur produisant un courant électrique.
in scheme: T69
narrower: T69-6086
narrower: T69-6092
narrower: T69-6102