générateur électrique alternatif
created: 2012-05-16T00:00:00+02:00
modified: 2015-10-07T16:01:58+02:00
status: 1
type: Concept
alternative label: alternateur
broader: T69-6084
definition: Générateur électrique produisant, à partir d'une source d'énergie mécanique, un courant électrique alternatif.
in scheme: T69
narrower: T69-6088
narrower: T69-6090