alternateur monophasé
created: 2012-05-16T00:00:00+02:00
modified: 2015-08-04T16:24:13+02:00
status: 1
type: Concept
broad match: http://data.bnf.fr/ark:/12148/cb123986174
broader: T69-6086
definition: Générateur électrique alternatif à une phase.
in scheme: T69