générateur électrique continu
created: 2012-05-16T00:00:00+02:00
modified: 2015-10-07T16:15:53+02:00
status: 1
type: Concept
broad match: Générateur électrique
broader: T69-6084
definition: Générateur électrique produisant un courant électrique continu.
in scheme: T69
narrower: T69-6094
narrower: T69-6096
narrower: T69-6098
narrower: T69-6100